{"text_format":"1","workbook":"xlsx","n_sheets":5,"sheets":["List1","NÁVOD","Pomocný list 1","Pomocný list 2","Pomocný list 3"],"not_rendered":{"charts":0,"images":0,"macros":1,"external_links":0,"defined_names":17,"comments":0,"pivot_tables":0},"unopened":[],"bounds":{"document_bytes":16777216,"sheet_cells":100000,"rows_first":2000,"rows_last":500,"rows_between":2000,"halvings":0,"cell_chars":16384,"cell_head_chars":4096},"cells_cut":0,"cells_raw":0,"read":"whole","date_system":"1900"}

{"sheet":"List1","index":0,"n_rows":248,"n_cols":8,"rows_kept":248,"cut":false,"hidden":false,"merged":[[43,5,43,6],[43,7,44,8],[44,5,44,6],[46,4,46,7],[47,1,47,3],[26,3,27,7],[21,0,21,3],[29,2,30,7],[31,4,31,7],[34,0,39,8],[41,2,41,3],[33,0,33,7],[41,0,41,1],[47,5,47,6],[41,5,41,8],[13,2,13,4],[14,2,14,3],[18,2,18,3],[18,4,18,7],[19,2,19,4],[19,6,19,7],[21,4,21,6],[23,0,23,1],[23,2,23,3],[23,4,24,5],[23,6,23,7],[13,0,13,1],[14,0,14,1],[17,0,17,6],[18,0,18,1],[19,0,19,1],[6,2,6,8],[7,2,7,5],[11,0,11,2],[9,1,9,2],[12,3,12,7],[9,6,9,7],[0,0,0,8],[1,0,3,8],[4,0,4,8],[8,1,8,2],[10,6,10,7],[12,0,12,2],[49,0,50,8],[52,2,52,3],[99,0,100,8],[93,0,98,8],[89,2,89,7],[76,0,78,8],[90,1,90,2],[90,4,90,5],[64,5,64,6],[79,2,79,7],[80,2,80,7],[81,2,81,7],[82,2,82,7],[83,2,83,7],[84,2,84,7],[72,5,72,7],[87,0,88,8],[65,5,65,6],[66,0,66,2],[67,0,67,8],[68,5,68,7],[73,0,73,4],[70,5,70,6],[102,0,102,8],[103,0,106,8],[108,0,108,8],[109,0,111,8],[113,0,113,5],[113,6,113,8],[114,1,114,5],[114,7,114,8],[115,0,116,0],[115,1,116,5],[115,6,116,6],[115,7,116,8],[117,0,118,0],[117,1,118,5],[117,6,118,6],[117,7,118,8],[119,0,120,0],[119,1,120,5],[119,6,120,6],[119,7,120,8],[121,0,122,0],[121,1,122,5],[121,6,122,6],[121,7,122,8],[123,0,124,0],[123,1,124,5],[123,6,124,6],[123,7,124,8],[125,0,126,0],[125,1,126,5],[125,6,126,6],[125,7,126,8],[127,0,128,0],[127,1,128,5],[127,6,128,6],[127,7,128,8],[129,0,130,0],[129,1,130,5],[129,6,130,6],[129,7,130,8],[131,0,132,0],[131,1,132,5],[131,6,132,6],[131,7,132,8],[133,0,134,0],[133,1,134,5],[133,6,134,6],[133,7,134,8],[135,0,136,0],[135,1,136,5],[135,6,136,6],[135,7,136,8],[137,0,138,0],[137,1,138,5],[137,6,138,6],[137,7,138,8],[139,0,140,0],[139,1,140,5],[139,6,140,6],[139,7,140,8],[141,0,142,0],[141,1,142,5],[141,6,142,6],[141,7,142,8],[143,0,144,0],[143,1,144,5],[143,6,144,6],[143,7,144,8],[145,1,145,5],[145,7,145,8],[146,1,146,5],[146,7,146,8],[147,1,147,5],[147,7,147,8],[148,1,148,5],[148,7,148,8],[149,1,149,5],[149,7,149,8],[150,1,150,5],[150,7,150,8],[151,1,151,5],[151,7,151,8],[152,1,152,5],[152,7,152,8],[153,1,153,5],[153,7,153,8],[154,1,154,5],[154,7,154,8],[155,1,155,5],[155,7,155,8],[156,1,156,5],[156,7,156,8],[157,1,157,5],[157,7,157,8],[158,1,158,5],[158,7,158,8],[159,1,159,5],[159,7,159,8],[160,1,160,5],[160,7,160,8],[161,1,161,5],[161,7,161,8],[162,1,162,5],[162,7,162,8],[163,1,163,5],[163,7,163,8],[164,1,164,5],[164,7,164,8],[167,1,167,5],[167,7,167,8],[165,1,165,5],[165,7,165,8],[166,1,166,5],[166,7,166,8],[223,0,223,2],[224,0,224,2],[225,0,225,2],[219,3,219,4],[220,3,220,4],[221,3,221,4],[222,3,222,4],[223,3,223,4],[224,3,224,4],[225,3,225,4],[211,5,211,6],[212,5,212,6],[219,0,219,2],[220,0,220,2],[221,0,221,2],[222,0,222,2],[211,3,211,4],[212,3,212,4],[213,3,213,4],[179,0,179,6],[179,7,179,8],[180,0,180,6],[180,7,180,8],[181,7,181,8],[182,0,182,8],[183,0,183,8],[185,0,185,2],[185,3,185,4],[185,5,185,6],[185,7,185,8],[170,1,170,5],[170,7,170,8],[168,7,168,8],[168,1,168,5],[171,7,171,8],[172,7,172,8],[169,1,169,5],[169,7,169,8],[178,7,178,8],[173,7,173,8],[174,6,174,8],[176,0,176,6],[176,7,177,8],[178,0,178,6],[186,7,186,8],[187,0,187,2],[187,3,187,4],[187,5,187,6],[187,7,187,8],[188,3,188,4],[188,5,188,6],[188,7,188,8],[189,3,189,4],[189,5,189,6],[189,7,189,8],[186,0,186,2],[186,3,186,4],[186,5,186,6],[190,3,190,4],[190,5,190,6],[190,7,190,8],[191,3,191,4],[191,5,191,6],[191,7,191,8],[192,3,192,4],[192,5,192,6],[192,7,192,8],[194,0,194,2],[194,3,194,4],[194,5,194,6],[195,0,195,2],[195,3,195,4],[195,6,199,6],[196,0,196,2],[196,3,196,4],[197,3,197,4],[198,3,198,4],[199,3,199,4],[200,0,200,2],[200,3,200,4],[200,5,201,6],[201,0,201,2],[201,3,201,4],[227,0,228,8],[213,0,213,2],[213,5,213,6],[207,3,207,4],[212,0,212,2],[207,0,207,2],[208,0,208,2],[209,0,209,2],[210,0,210,2],[211,0,211,2],[208,3,208,4],[209,3,209,4],[210,3,210,4],[202,0,203,8],[204,0,204,8],[207,5,207,6],[208,5,208,6],[209,5,209,6],[210,5,210,6],[250,0,250,8],[251,0,251,8],[252,0,252,8],[253,0,253,8],[229,0,234,8],[239,1,239,4],[239,6,239,7],[241,4,246,7],[247,4,249,7],[235,0,237,8],[241,0,242,2],[243,0,243,1],[244,0,244,1],[264,0,264,8],[258,0,258,8],[259,0,259,8],[260,0,260,8],[261,0,261,8],[254,0,254,8],[255,0,255,8],[256,0,256,8],[257,0,257,8],[262,0,262,8],[263,0,263,8]]}
["Žádost o poskytnutí dotace"]
["z rozpočtu Odboru umění, literatury a knihoven Ministerstva kultury, Maltézské nám. 471/1, 118 11 Praha 1 na podprogram Informační centra knihoven v rámci programu Veřejné informační služby knihoven "]
[]
[]
["VISK 3 pro rok 2018"]
[]
["NÁZEV ŽADATELE:"]
["Právní forma:",null,null,null,null,null,"Rezort/jiný typ:"]
["IČ:"]
["DIČ:",null,null,null,"Je-li žadatel fyzická osoba:","Rodné číslo:"]
[null,null,null,null,null,"Datum narození:"]
["Adresa (sídlo) žadatele:"]
["Ulice a číslo popisné/orientační:"]
["Obec/město:",null,null,null,null,"PSČ:  "]
["Okres:",null,null,null,null,"Kód okresu",{"$f":"VLOOKUP(C15,číselník,2)","v":{"$error":"#N/A"}}]
["Kraj",null,{"$f":"VLOOKUP(C15,číselník,3)","v":{"$error":"#N/A"}},null,null,"Kód kraje",{"$f":"VLOOKUP(C15,číselník,4)","v":{"$error":"#N/A"}}]
[]
["Jméno a příjmení statutárního zástupce/statutárních zástupců:"]
["Oslovení/Jméno:"]
["Kontaktní email:",null,null,null,null,"Tel:  "]
{"$rows_left_out":229}
{"sheet":"NÁVOD","index":1,"n_rows":20,"n_cols":1,"rows_kept":20,"cut":false,"hidden":false,"merged":[]}
["Tato strana s pokyny je jen pro informaci, netiskněte ji či jinak nepřikládejte k tištěné verzi projektu!"]
["Návod k vyplnění formuláře"]
["* čísla vyplňujte vždy prostým zadáním číslic (např. 35680) a nikoliv jinak (tedy ne 35.680, 35 tis. Kč apod.)"]
["* již vyplněnou buňku lze nadále upravovat/editovat, případně obsah buňky smazat (klávesa DELETE)"]
["* v Rozpočtu projektu (strany 3-4) vždy důsledně vyberte Položku z rolovacího seznamu (první sloupec) - její správné přiřazení je klíčové pro výpočty a další automatizované zpracování formuláře. Nebude-li v řádku Položka vybrána, nebude tento řádek započítán do celkových souhrnů! (a bude používán jen jako doplňková informace)"]
[]
["* Stručná charakteristika (anotace) projektu - zde vysvětlete podstatu projektu, jeho průběh, stěžejní myšlenku atd. Viz vzorová žádost."]
["* Řádek 201 formuláře (Investiční náklady převedené do spoluúčasti) + řádek 202 formuláře (Neinvestiční náklady převedené do spoluúčasti (do položky Ostatní)): jedná se o rozdíly vzniklé zakrouhlením požadované dotace (investiční i neinvestiční) na celé tisíce dolů. O tyto částky je automaticky navýšena vlastní finanční spoluúčast na projektu."]
[]
["Jak postupovat při zaslání žádosti o dotaci"]
["Elektronická verze"]
["1. Vyplňte tento formulář žádosti (List 1) a soubor si uložte ve formátu *.xls (EXCEL!). Nepřevádějte do jiných formátů! Současně vyplňte popis projektu a soubor uložte ve formátu *.doc nebo *.rtf."]
["2. Do jednoho samostatného souboru ve formátu PDF vložte povinné, resp. případné fakultativní přílohy, máte-li nějaké."]
["3. Tyto tři - a pouze tři - výše uvedené soubory zašlete elektronicky dle pokynů uvedených v Závěrečných ustanoveních podmínek vyhlášení dotace. (Ve stručnosti: Soubory zašlete na emailovou adresu: VISK3@mkcr.cz. Do „Předmětu“ uveďte „VISK3/2018“ a název žadatele, případně i název projektu. Velikost emailové zprávy nesmí včetně všech příloh přesáhnout 8MB.)"]
["Tištěná verze"]
["1. Formulář žádosti (XLS) včetně Popisu projektu (DOC) vytiskněte a opatřete nezbytnými podpisy a razítky. Verze zaslaná elektronicky se nesmí lišit textově od verze tištěné, jen neobsahuje podpisy a razítka! Originály žádosti budou součástí archivu žádosti, projekt bude hodnocen komisí dle dodaných elektronických kopií."]
["2. K tištěné verzi přidejte další požadované dokumenty dle Podmínek vyhlášení dotace, především doklad prokazující oprávnění osoby jednající za žadatele a povinné přílohy (pokud jsou pro daný typ projektu vyžadovány)!"]
["3. Vytištěný formulář žádosti opatřený všemi náležitostmi včetně popisu projektu a včetně povinných a případných fakultativních příloh a další požadované dokumenty zašlete dle pokynů uvedených v Závěrečných ustanoveních podmínek vyhlášení dotace."]
["4. Projekty zpracované podle výše uvedených podmínek musí být zaslány na adresu: Ministerstvo kultury, odbor umění, literatury a knihoven, Maltézské náměstí 1, 118 11  Praha 1 – Malá Strana, nebo datovou schránkou na adresu MK nebo osobně doručeny prostřednictvím podatelny MK do 10. 12. 2016 včetně."]
["5. Za rozhodující se považuje datum odevzdání do poštovní přepravy (resp. datum převzetí podatelnou MK při osobním podání)."]
{"$rows_left_out":1}
{"sheet":"Pomocný list 1","index":2,"n_rows":79,"n_cols":16,"rows_kept":79,"cut":false,"hidden":false,"merged":[[0,7,1,7]]}
["Okres",null,"Kraj",null,"Region",null,null,"Okresy podle abecedy","1a) DHDM","Vážený pan",null,null,"Krajská","o.s.","ano","ADSL"]
["Územní jednotka","LAU1","Územní jednotka","NUTS3","Územní jednotka","NUTS2",null,null,"1b) DDNM","Vážená paní",null,null,"Městská","nadace","ne","ISDN"]
["Benešov",201,"Středočeský kraj","CZ020","Střední Čechy","CZ02",null,"Benešov","2) služby",null,null,null,"Obecní","o.p.s.",null,"Pevná linka"]
["Beroun",202,"Středočeský kraj","CZ020","Střední Čechy","CZ02",null,"Beroun","3) OON",null,null,null,"Školní","s.r.o.",null,"Kabel"]
["Blansko",641,"Jihomoravský kraj","CZ064","Jihovýchod","CZ06",null,"Blansko","4) ostatní",null,null,null,"Vysokoškolská",null,null,"Optika"]
["Brno-město",642,"Jihomoravský kraj","CZ064","Jihovýchod","CZ06",null,"Brno-město","5) INVESTICE",null,null,null,"Muzejní",null,null,"Radiový spoj"]
["Brno-venkov",643,"Jihomoravský kraj","CZ064","Jihovýchod","CZ06",null,"Brno-venkov",null,null,null,null,"Jiná",null,null,"Vytáčené spojení"]
["Bruntál",801,"Moravskoslezský kraj","CZ080","Moravskoslezsko","CZ08",null,"Bruntál",null,null,null,null,null,null,null,"Jiné"]
["Břeclav",644,"Jihomoravský kraj","CZ064","Jihovýchod","CZ06",null,"Břeclav"]
["Česká Lípa",511,"Liberecký kraj","CZ051","Severovýchod","CZ05",null,"Česká Lípa"]
["České Budějovice",311,"Jihočeský kraj","CZ031","Jihozápad","CZ03",null,"České Budějovice"]
["Český Krumlov",312,"Jihočeský kraj","CZ031","Jihozápad","CZ03",null,"Český Krumlov"]
["Děčín",421,"Ústecký kraj","CZ042","Severozápad","CZ04",null,"Děčín"]
["Domažlice",321,"Plzeňský kraj","CZ032","Jihozápad","CZ03",null,"Domažlice"]
["Frýdek-Místek",802,"Moravskoslezský kraj","CZ080","Moravskoslezsko","CZ08",null,"Frýdek-Místek"]
["Havlíčkův Brod",631,"Kraj Vysočina","CZ063","Jihovýchod","CZ06",null,"Havlíčkův Brod"]
["Hodonín",645,"Jihomoravský kraj","CZ064","Jihovýchod","CZ06",null,"Hodonín"]
["Hradec Králové",521,"Královéhradecký kraj","CZ052","Severovýchod","CZ05",null,"Hradec Králové"]
["Cheb",411,"Karlovarský kraj","CZ041","Severozápad","CZ04",null,"Cheb"]
["Chomutov",422,"Ústecký kraj","CZ042","Severozápad","CZ04",null,"Chomutov"]
{"$rows_left_out":60}
{"sheet":"Pomocný list 2","index":3,"n_rows":59,"n_cols":12,"rows_kept":59,"cut":false,"hidden":false,"merged":[[0,8,0,9],[0,10,0,11],[0,0,0,1],[0,2,0,3],[0,4,0,5],[0,6,0,7]]}
["1a nákupy - drobný hmotný majetek",null,"1b nákupy - drobný dlouhodobý nehmotný majetek",null,"2 služby",null,"3 Ostatní osobní náklady (OON)",null,"4 Ostatní",null,"5 Investice"]
["dotace","spoluúčast","dotace","spoluúčast","dotace","spoluúčast","dotace","spoluúčast","dotace","spoluúčast","dotace","spoluúčast"]
[{"$f":"IF(List1!A116=\"1a) DHDM\",List1!G116,0)","v":0},{"$f":"IF(List1!A116=\"1a) DHDM\",List1!H116,0)","v":0},{"$f":"IF(List1!A116=\"1b) DDNM\",List1!G116,0)","v":0},{"$f":"IF(List1!A116=\"1b) DDNM\",List1!H116,0)","v":0},{"$f":"IF(List1!A116=\"2) služby\",List1!G116,0)","v":0},{"$f":"IF(List1!A116=\"2) služby\",List1!H116,0)","v":0},{"$f":"IF(List1!A116=\"3) OON\",List1!G116,0)","v":0},{"$f":"IF(List1!A116=\"3) OON\",List1!H116,0)","v":0},{"$f":"IF(List1!A116=\"4) ostatní\",List1!G116,0)","v":0},{"$f":"IF(List1!A116=\"4) ostatní\",List1!H116,0)","v":0},{"$f":"IF(List1!A116=\"5) INVESTICE\",List1!G116,0)","v":0},{"$f":"IF(List1!A116=\"5) INVESTICE\",List1!H116,0)","v":0}]
[{"$f":"IF(List1!A117=\"1a) DHDM\",List1!G117,0)","v":0},{"$f":"IF(List1!A117=\"1a) DHDM\",List1!H117,0)","v":0},{"$f":"IF(List1!A117=\"1b) DDNM\",List1!G117,0)","v":0},{"$f":"IF(List1!A117=\"1b) DDNM\",List1!H117,0)","v":0},{"$f":"IF(List1!A117=\"2) služby\",List1!G117,0)","v":0},{"$f":"IF(List1!A117=\"2) služby\",List1!H117,0)","v":0},{"$f":"IF(List1!A117=\"3) OON\",List1!G117,0)","v":0},{"$f":"IF(List1!A117=\"3) OON\",List1!H117,0)","v":0},{"$f":"IF(List1!A117=\"4) ostatní\",List1!G117,0)","v":0},{"$f":"IF(List1!A117=\"4) ostatní\",List1!H117,0)","v":0},{"$f":"IF(List1!A117=\"5) INVESTICE\",List1!G117,0)","v":0},{"$f":"IF(List1!A117=\"5) INVESTICE\",List1!H117,0)","v":0}]
[{"$f":"IF(List1!A118=\"1a) DHDM\",List1!G118,0)","v":0},{"$f":"IF(List1!A118=\"1a) DHDM\",List1!H118,0)","v":0},{"$f":"IF(List1!A118=\"1b) DDNM\",List1!G118,0)","v":0},{"$f":"IF(List1!A118=\"1b) DDNM\",List1!H118,0)","v":0},{"$f":"IF(List1!A118=\"2) služby\",List1!G118,0)","v":0},{"$f":"IF(List1!A118=\"2) služby\",List1!H118,0)","v":0},{"$f":"IF(List1!A118=\"3) OON\",List1!G118,0)","v":0},{"$f":"IF(List1!A118=\"3) OON\",List1!H118,0)","v":0},{"$f":"IF(List1!A118=\"4) ostatní\",List1!G118,0)","v":0},{"$f":"IF(List1!A118=\"4) ostatní\",List1!H118,0)","v":0},{"$f":"IF(List1!A118=\"5) INVESTICE\",List1!G118,0)","v":0},{"$f":"IF(List1!A118=\"5) INVESTICE\",List1!H118,0)","v":0}]
[{"$f":"IF(List1!A119=\"1a) DHDM\",List1!G119,0)","v":0},{"$f":"IF(List1!A119=\"1a) DHDM\",List1!H119,0)","v":0},{"$f":"IF(List1!A119=\"1b) DDNM\",List1!G119,0)","v":0},{"$f":"IF(List1!A119=\"1b) DDNM\",List1!H119,0)","v":0},{"$f":"IF(List1!A119=\"2) služby\",List1!G119,0)","v":0},{"$f":"IF(List1!A119=\"2) služby\",List1!H119,0)","v":0},{"$f":"IF(List1!A119=\"3) OON\",List1!G119,0)","v":0},{"$f":"IF(List1!A119=\"3) OON\",List1!H119,0)","v":0},{"$f":"IF(List1!A119=\"4) ostatní\",List1!G119,0)","v":0},{"$f":"IF(List1!A119=\"4) ostatní\",List1!H119,0)","v":0},{"$f":"IF(List1!A119=\"5) INVESTICE\",List1!G119,0)","v":0},{"$f":"IF(List1!A119=\"5) INVESTICE\",List1!H119,0)","v":0}]
[{"$f":"IF(List1!A120=\"1a) DHDM\",List1!G120,0)","v":0},{"$f":"IF(List1!A120=\"1a) DHDM\",List1!H120,0)","v":0},{"$f":"IF(List1!A120=\"1b) DDNM\",List1!G120,0)","v":0},{"$f":"IF(List1!A120=\"1b) DDNM\",List1!H120,0)","v":0},{"$f":"IF(List1!A120=\"2) služby\",List1!G120,0)","v":0},{"$f":"IF(List1!A120=\"2) služby\",List1!H120,0)","v":0},{"$f":"IF(List1!A120=\"3) OON\",List1!G120,0)","v":0},{"$f":"IF(List1!A120=\"3) OON\",List1!H120,0)","v":0},{"$f":"IF(List1!A120=\"4) ostatní\",List1!G120,0)","v":0},{"$f":"IF(List1!A120=\"4) ostatní\",List1!H120,0)","v":0},{"$f":"IF(List1!A120=\"5) INVESTICE\",List1!G120,0)","v":0},{"$f":"IF(List1!A120=\"5) INVESTICE\",List1!H120,0)","v":0}]
[{"$f":"IF(List1!A121=\"1a) DHDM\",List1!G121,0)","v":0},{"$f":"IF(List1!A121=\"1a) DHDM\",List1!H121,0)","v":0},{"$f":"IF(List1!A121=\"1b) DDNM\",List1!G121,0)","v":0},{"$f":"IF(List1!A121=\"1b) DDNM\",List1!H121,0)","v":0},{"$f":"IF(List1!A121=\"2) služby\",List1!G121,0)","v":0},{"$f":"IF(List1!A121=\"2) služby\",List1!H121,0)","v":0},{"$f":"IF(List1!A121=\"3) OON\",List1!G121,0)","v":0},{"$f":"IF(List1!A121=\"3) OON\",List1!H121,0)","v":0},{"$f":"IF(List1!A121=\"4) ostatní\",List1!G121,0)","v":0},{"$f":"IF(List1!A121=\"4) ostatní\",List1!H121,0)","v":0},{"$f":"IF(List1!A121=\"5) INVESTICE\",List1!G121,0)","v":0},{"$f":"IF(List1!A121=\"5) INVESTICE\",List1!H121,0)","v":0}]
[{"$f":"IF(List1!A122=\"1a) DHDM\",List1!G122,0)","v":0},{"$f":"IF(List1!A122=\"1a) DHDM\",List1!H122,0)","v":0},{"$f":"IF(List1!A122=\"1b) DDNM\",List1!G122,0)","v":0},{"$f":"IF(List1!A122=\"1b) DDNM\",List1!H122,0)","v":0},{"$f":"IF(List1!A122=\"2) služby\",List1!G122,0)","v":0},{"$f":"IF(List1!A122=\"2) služby\",List1!H122,0)","v":0},{"$f":"IF(List1!A122=\"3) OON\",List1!G122,0)","v":0},{"$f":"IF(List1!A122=\"3) OON\",List1!H122,0)","v":0},{"$f":"IF(List1!A122=\"4) ostatní\",List1!G122,0)","v":0},{"$f":"IF(List1!A122=\"4) ostatní\",List1!H122,0)","v":0},{"$f":"IF(List1!A122=\"5) INVESTICE\",List1!G122,0)","v":0},{"$f":"IF(List1!A122=\"5) INVESTICE\",List1!H122,0)","v":0}]
[{"$f":"IF(List1!A123=\"1a) DHDM\",List1!G123,0)","v":0},{"$f":"IF(List1!A123=\"1a) DHDM\",List1!H123,0)","v":0},{"$f":"IF(List1!A123=\"1b) DDNM\",List1!G123,0)","v":0},{"$f":"IF(List1!A123=\"1b) DDNM\",List1!H123,0)","v":0},{"$f":"IF(List1!A123=\"2) služby\",List1!G123,0)","v":0},{"$f":"IF(List1!A123=\"2) služby\",List1!H123,0)","v":0},{"$f":"IF(List1!A123=\"3) OON\",List1!G123,0)","v":0},{"$f":"IF(List1!A123=\"3) OON\",List1!H123,0)","v":0},{"$f":"IF(List1!A123=\"4) ostatní\",List1!G123,0)","v":0},{"$f":"IF(List1!A123=\"4) ostatní\",List1!H123,0)","v":0},{"$f":"IF(List1!A123=\"5) INVESTICE\",List1!G123,0)","v":0},{"$f":"IF(List1!A123=\"5) INVESTICE\",List1!H123,0)","v":0}]
[{"$f":"IF(List1!A124=\"1a) DHDM\",List1!G124,0)","v":0},{"$f":"IF(List1!A124=\"1a) DHDM\",List1!H124,0)","v":0},{"$f":"IF(List1!A124=\"1b) DDNM\",List1!G124,0)","v":0},{"$f":"IF(List1!A124=\"1b) DDNM\",List1!H124,0)","v":0},{"$f":"IF(List1!A124=\"2) služby\",List1!G124,0)","v":0},{"$f":"IF(List1!A124=\"2) služby\",List1!H124,0)","v":0},{"$f":"IF(List1!A124=\"3) OON\",List1!G124,0)","v":0},{"$f":"IF(List1!A124=\"3) OON\",List1!H124,0)","v":0},{"$f":"IF(List1!A124=\"4) ostatní\",List1!G124,0)","v":0},{"$f":"IF(List1!A124=\"4) ostatní\",List1!H124,0)","v":0},{"$f":"IF(List1!A124=\"5) INVESTICE\",List1!G124,0)","v":0},{"$f":"IF(List1!A124=\"5) INVESTICE\",List1!H124,0)","v":0}]
[{"$f":"IF(List1!A125=\"1a) DHDM\",List1!G125,0)","v":0},{"$f":"IF(List1!A125=\"1a) DHDM\",List1!H125,0)","v":0},{"$f":"IF(List1!A125=\"1b) DDNM\",List1!G125,0)","v":0},{"$f":"IF(List1!A125=\"1b) DDNM\",List1!H125,0)","v":0},{"$f":"IF(List1!A125=\"2) služby\",List1!G125,0)","v":0},{"$f":"IF(List1!A125=\"2) služby\",List1!H125,0)","v":0},{"$f":"IF(List1!A125=\"3) OON\",List1!G125,0)","v":0},{"$f":"IF(List1!A125=\"3) OON\",List1!H125,0)","v":0},{"$f":"IF(List1!A125=\"4) ostatní\",List1!G125,0)","v":0},{"$f":"IF(List1!A125=\"4) ostatní\",List1!H125,0)","v":0},{"$f":"IF(List1!A125=\"5) INVESTICE\",List1!G125,0)","v":0},{"$f":"IF(List1!A125=\"5) INVESTICE\",List1!H125,0)","v":0}]
[{"$f":"IF(List1!A126=\"1a) DHDM\",List1!G126,0)","v":0},{"$f":"IF(List1!A126=\"1a) DHDM\",List1!H126,0)","v":0},{"$f":"IF(List1!A126=\"1b) DDNM\",List1!G126,0)","v":0},{"$f":"IF(List1!A126=\"1b) DDNM\",List1!H126,0)","v":0},{"$f":"IF(List1!A126=\"2) služby\",List1!G126,0)","v":0},{"$f":"IF(List1!A126=\"2) služby\",List1!H126,0)","v":0},{"$f":"IF(List1!A126=\"3) OON\",List1!G126,0)","v":0},{"$f":"IF(List1!A126=\"3) OON\",List1!H126,0)","v":0},{"$f":"IF(List1!A126=\"4) ostatní\",List1!G126,0)","v":0},{"$f":"IF(List1!A126=\"4) ostatní\",List1!H126,0)","v":0},{"$f":"IF(List1!A126=\"5) INVESTICE\",List1!G126,0)","v":0},{"$f":"IF(List1!A126=\"5) INVESTICE\",List1!H126,0)","v":0}]
[{"$f":"IF(List1!A127=\"1a) DHDM\",List1!G127,0)","v":0},{"$f":"IF(List1!A127=\"1a) DHDM\",List1!H127,0)","v":0},{"$f":"IF(List1!A127=\"1b) DDNM\",List1!G127,0)","v":0},{"$f":"IF(List1!A127=\"1b) DDNM\",List1!H127,0)","v":0},{"$f":"IF(List1!A127=\"2) služby\",List1!G127,0)","v":0},{"$f":"IF(List1!A127=\"2) služby\",List1!H127,0)","v":0},{"$f":"IF(List1!A127=\"3) OON\",List1!G127,0)","v":0},{"$f":"IF(List1!A127=\"3) OON\",List1!H127,0)","v":0},{"$f":"IF(List1!A127=\"4) ostatní\",List1!G127,0)","v":0},{"$f":"IF(List1!A127=\"4) ostatní\",List1!H127,0)","v":0},{"$f":"IF(List1!A127=\"5) INVESTICE\",List1!G127,0)","v":0},{"$f":"IF(List1!A127=\"5) INVESTICE\",List1!H127,0)","v":0}]
[{"$f":"IF(List1!A128=\"1a) DHDM\",List1!G128,0)","v":0},{"$f":"IF(List1!A128=\"1a) DHDM\",List1!H128,0)","v":0},{"$f":"IF(List1!A128=\"1b) DDNM\",List1!G128,0)","v":0},{"$f":"IF(List1!A128=\"1b) DDNM\",List1!H128,0)","v":0},{"$f":"IF(List1!A128=\"2) služby\",List1!G128,0)","v":0},{"$f":"IF(List1!A128=\"2) služby\",List1!H128,0)","v":0},{"$f":"IF(List1!A128=\"3) OON\",List1!G128,0)","v":0},{"$f":"IF(List1!A128=\"3) OON\",List1!H128,0)","v":0},{"$f":"IF(List1!A128=\"4) ostatní\",List1!G128,0)","v":0},{"$f":"IF(List1!A128=\"4) ostatní\",List1!H128,0)","v":0},{"$f":"IF(List1!A128=\"5) INVESTICE\",List1!G128,0)","v":0},{"$f":"IF(List1!A128=\"5) INVESTICE\",List1!H128,0)","v":0}]
[{"$f":"IF(List1!A129=\"1a) DHDM\",List1!G129,0)","v":0},{"$f":"IF(List1!A129=\"1a) DHDM\",List1!H129,0)","v":0},{"$f":"IF(List1!A129=\"1b) DDNM\",List1!G129,0)","v":0},{"$f":"IF(List1!A129=\"1b) DDNM\",List1!H129,0)","v":0},{"$f":"IF(List1!A129=\"2) služby\",List1!G129,0)","v":0},{"$f":"IF(List1!A129=\"2) služby\",List1!H129,0)","v":0},{"$f":"IF(List1!A129=\"3) OON\",List1!G129,0)","v":0},{"$f":"IF(List1!A129=\"3) OON\",List1!H129,0)","v":0},{"$f":"IF(List1!A129=\"4) ostatní\",List1!G129,0)","v":0},{"$f":"IF(List1!A129=\"4) ostatní\",List1!H129,0)","v":0},{"$f":"IF(List1!A129=\"5) INVESTICE\",List1!G129,0)","v":0},{"$f":"IF(List1!A129=\"5) INVESTICE\",List1!H129,0)","v":0}]
[{"$f":"IF(List1!A130=\"1a) DHDM\",List1!G130,0)","v":0},{"$f":"IF(List1!A130=\"1a) DHDM\",List1!H130,0)","v":0},{"$f":"IF(List1!A130=\"1b) DDNM\",List1!G130,0)","v":0},{"$f":"IF(List1!A130=\"1b) DDNM\",List1!H130,0)","v":0},{"$f":"IF(List1!A130=\"2) služby\",List1!G130,0)","v":0},{"$f":"IF(List1!A130=\"2) služby\",List1!H130,0)","v":0},{"$f":"IF(List1!A130=\"3) OON\",List1!G130,0)","v":0},{"$f":"IF(List1!A130=\"3) OON\",List1!H130,0)","v":0},{"$f":"IF(List1!A130=\"4) ostatní\",List1!G130,0)","v":0},{"$f":"IF(List1!A130=\"4) ostatní\",List1!H130,0)","v":0},{"$f":"IF(List1!A130=\"5) INVESTICE\",List1!G130,0)","v":0},{"$f":"IF(List1!A130=\"5) INVESTICE\",List1!H130,0)","v":0}]
[{"$f":"IF(List1!A131=\"1a) DHDM\",List1!G131,0)","v":0},{"$f":"IF(List1!A131=\"1a) DHDM\",List1!H131,0)","v":0},{"$f":"IF(List1!A131=\"1b) DDNM\",List1!G131,0)","v":0},{"$f":"IF(List1!A131=\"1b) DDNM\",List1!H131,0)","v":0},{"$f":"IF(List1!A131=\"2) služby\",List1!G131,0)","v":0},{"$f":"IF(List1!A131=\"2) služby\",List1!H131,0)","v":0},{"$f":"IF(List1!A131=\"3) OON\",List1!G131,0)","v":0},{"$f":"IF(List1!A131=\"3) OON\",List1!H131,0)","v":0},{"$f":"IF(List1!A131=\"4) ostatní\",List1!G131,0)","v":0},{"$f":"IF(List1!A131=\"4) ostatní\",List1!H131,0)","v":0},{"$f":"IF(List1!A131=\"5) INVESTICE\",List1!G131,0)","v":0},{"$f":"IF(List1!A131=\"5) INVESTICE\",List1!H131,0)","v":0}]
[{"$f":"IF(List1!A132=\"1a) DHDM\",List1!G132,0)","v":0},{"$f":"IF(List1!A132=\"1a) DHDM\",List1!H132,0)","v":0},{"$f":"IF(List1!A132=\"1b) DDNM\",List1!G132,0)","v":0},{"$f":"IF(List1!A132=\"1b) DDNM\",List1!H132,0)","v":0},{"$f":"IF(List1!A132=\"2) služby\",List1!G132,0)","v":0},{"$f":"IF(List1!A132=\"2) služby\",List1!H132,0)","v":0},{"$f":"IF(List1!A132=\"3) OON\",List1!G132,0)","v":0},{"$f":"IF(List1!A132=\"3) OON\",List1!H132,0)","v":0},{"$f":"IF(List1!A132=\"4) ostatní\",List1!G132,0)","v":0},{"$f":"IF(List1!A132=\"4) ostatní\",List1!H132,0)","v":0},{"$f":"IF(List1!A132=\"5) INVESTICE\",List1!G132,0)","v":0},{"$f":"IF(List1!A132=\"5) INVESTICE\",List1!H132,0)","v":0}]
[{"$f":"IF(List1!A133=\"1a) DHDM\",List1!G133,0)","v":0},{"$f":"IF(List1!A133=\"1a) DHDM\",List1!H133,0)","v":0},{"$f":"IF(List1!A133=\"1b) DDNM\",List1!G133,0)","v":0},{"$f":"IF(List1!A133=\"1b) DDNM\",List1!H133,0)","v":0},{"$f":"IF(List1!A133=\"2) služby\",List1!G133,0)","v":0},{"$f":"IF(List1!A133=\"2) služby\",List1!H133,0)","v":0},{"$f":"IF(List1!A133=\"3) OON\",List1!G133,0)","v":0},{"$f":"IF(List1!A133=\"3) OON\",List1!H133,0)","v":0},{"$f":"IF(List1!A133=\"4) ostatní\",List1!G133,0)","v":0},{"$f":"IF(List1!A133=\"4) ostatní\",List1!H133,0)","v":0},{"$f":"IF(List1!A133=\"5) INVESTICE\",List1!G133,0)","v":0},{"$f":"IF(List1!A133=\"5) INVESTICE\",List1!H133,0)","v":0}]
{"$rows_left_out":40}
{"sheet":"Pomocný list 3","index":4,"n_rows":32,"n_cols":1,"rows_kept":32,"cut":false,"hidden":false,"merged":[]}
["1) Zlepšení vzájemné kooperace knihoven"]
["2) Zahájení a pokračování automatizace knihovny"]
["3) Zahájení výpůjček e-knih"]
["4) Upgrade z UNIMARC na MARC21"]
["5) Projekty celostátního významu"]
["6) Podpora dostupnosti služeb pro zdravotně postižené"]
["7) Obnova technického a programového vybavení"]
["8) Ostatní projekty"]
["9) Projekty dlouhodobé ochrany dat"]
[]
[]
["provozujeme regionální systém"]
["jsme uživateli regionálního systému"]
["chystáme se zapojit do regionálního systému"]
["regionální systém se nás netýká"]
[]
[]
[]
["kraj / příspěvková organizace kraje"]
["obec / příspěvková organizace obce"]
{"$rows_left_out":12}